Target
Peptide deformylase 1A, chloroplastic/mitochondrial
Ligand
BDBM50201873
Substrate
Meas. Tech.
ChEMBL_423228 (CHEMBL912247)
IC50
250000±n/a nM
Citation
 Boularot, AGiglione, CPetit, SDuroc, YAlves de Sousa, RLarue, VCresteil, TDardel, FArtaud, IMeinnel, T Discovery and refinement of a new structural class of potent peptide deformylase inhibitors. J Med Chem 50:10-20 (2007)  
Target
Name:
Peptide deformylase 1A, chloroplastic/mitochondrial
Synonyms:
AtDEF1 DEF1 PDF 1A Peptide deformylase 1A, chloroplastic | Polypeptide deformylase
Type:
PROTEIN
Mol. Mass.:
30001.50
Organism:
Arabidopsis thaliana
Description:
ChEMBL_423228
Residue:
269
  
Inhibitor
Name:
BDBM50201873
Synonyms:
2-(6-bromo-1H-indol-3-yl)-N-hydroxyacetamide | CHEMBL219438
Type:
Small organic molecule
Emp. Form.:
C11H11BrN2O2
Mol. Mass.:
283.121
SMILES:
ONCC(=O)Cc1c[nH]c2cc(Br)ccc12
: