Target
Peptide deformylase 1A, chloroplastic/mitochondrial
Ligand
BDBM50201884
Substrate
Meas. Tech.
ChEMBL_423228 (CHEMBL912247)
IC50
14000±n/a nM
Citation
 Boularot, AGiglione, CPetit, SDuroc, YAlves de Sousa, RLarue, VCresteil, TDardel, FArtaud, IMeinnel, T Discovery and refinement of a new structural class of potent peptide deformylase inhibitors. J Med Chem 50:10-20 (2007)  
Target
Name:
Peptide deformylase 1A, chloroplastic/mitochondrial
Synonyms:
AtDEF1 DEF1 PDF 1A Peptide deformylase 1A, chloroplastic | Polypeptide deformylase
Type:
PROTEIN
Mol. Mass.:
30001.50
Organism:
Arabidopsis thaliana
Description:
ChEMBL_423228
Residue:
269
  
Inhibitor
Name:
BDBM50201884
Synonyms:
5-bromo-3-hydroxycarbamoylmethylindole-1-carboxylic acid | CHEMBL386468
Type:
Small organic molecule
Emp. Form.:
C19H17BrN2O4
Mol. Mass.:
417.253
SMILES:
ONCC(=O)Cc1cn(C(=O)OCc2ccccc2)c2ccc(Br)cc12
: