Target
Androgen receptor
Ligand
BDBM50194328
Substrate
Meas. Tech.
ChEMBL_424343 (CHEMBL909546)
IC50
930±n/a nM
Citation
 Lanter, JCFiordeliso, JJAllan, GFMusto, AHahn, do WSui, Z A bioisosteric approach to the discovery of indole carbinol androgen receptor ligands. Bioorg Med Chem Lett 16:5646-9 (2006)  
Target
Name:
Androgen receptor
Synonyms:
ANDR_RAT Ar Nr3c4 | androgen
Type:
Enzyme
Mol. Mass.:
98219.08
Organism:
Rattus norvegicus (Rat)
Description:
P15207
Residue:
902
  
Inhibitor
Name:
BDBM50194328
Synonyms:
1-(4-aminophenylthio)-2-(5-chloro-6-(trifluoromethyl)-1H-indol-2-yl)propan-2-ol | CHEMBL387137
Type:
Small organic molecule
Emp. Form.:
C18H16ClF3N2OS
Mol. Mass.:
400.846
SMILES:
CC(O)(CSc1ccc(N)cc1)c1cc2cc(Cl)c(cc2[nH]1)C(F)(F)F
: