Target
Androgen receptor
Ligand
BDBM50194327
Substrate
Meas. Tech.
ChEMBL_424343 (CHEMBL909546)
IC50
480±n/a nM
Citation
 Lanter, JCFiordeliso, JJAllan, GFMusto, AHahn, do WSui, Z A bioisosteric approach to the discovery of indole carbinol androgen receptor ligands. Bioorg Med Chem Lett 16:5646-9 (2006)  
Target
Name:
Androgen receptor
Synonyms:
ANDR_RAT Ar Nr3c4 | androgen
Type:
Enzyme
Mol. Mass.:
98219.08
Organism:
Rattus norvegicus (Rat)
Description:
P15207
Residue:
902
  
Inhibitor
Name:
BDBM50194327
Synonyms:
2-(5-cyano-6-(trifluoromethyl)-1H-indol-2-yl)-2-hydroxypropyl benzoate | CHEMBL220747
Type:
Small organic molecule
Emp. Form.:
C20H15F3N2O3
Mol. Mass.:
388.3399
SMILES:
CC(O)(COC(=O)c1ccccc1)c1cc2cc(C#N)c(cc2[nH]1)C(F)(F)F
: