Target
Androgen receptor
Ligand
BDBM50194339
Substrate
Meas. Tech.
ChEMBL_424343 (CHEMBL909546)
IC50
940±n/a nM
Citation
 Lanter, JCFiordeliso, JJAllan, GFMusto, AHahn, do WSui, Z A bioisosteric approach to the discovery of indole carbinol androgen receptor ligands. Bioorg Med Chem Lett 16:5646-9 (2006)  
Target
Name:
Androgen receptor
Synonyms:
ANDR_RAT Ar Nr3c4 | androgen
Type:
Enzyme
Mol. Mass.:
98219.08
Organism:
Rattus norvegicus (Rat)
Description:
P15207
Residue:
902
  
Inhibitor
Name:
BDBM50194339
Synonyms:
CHEMBL376323 | biphenyl-4-carboxylic acid 2-hydroxy-2-(5-nitro-6-trifluoromethyl-1H-indol-2-yl)-propyl ester
Type:
Small organic molecule
Emp. Form.:
C25H19F3N2O5
Mol. Mass.:
484.424
SMILES:
CC(O)(COC(=O)c1ccc(cc1)-c1ccccc1)c1cc2cc(c(cc2[nH]1)C(F)(F)F)[N+]([O-])=O
: