Target
Androgen receptor
Ligand
BDBM50194353
Substrate
Meas. Tech.
ChEMBL_424343 (CHEMBL909546)
IC50
440±n/a nM
Citation
 Lanter, JCFiordeliso, JJAllan, GFMusto, AHahn, do WSui, Z A bioisosteric approach to the discovery of indole carbinol androgen receptor ligands. Bioorg Med Chem Lett 16:5646-9 (2006)  
Target
Name:
Androgen receptor
Synonyms:
ANDR_RAT Ar Nr3c4 | androgen
Type:
Enzyme
Mol. Mass.:
98219.08
Organism:
Rattus norvegicus (Rat)
Description:
P15207
Residue:
902
  
Inhibitor
Name:
BDBM50194353
Synonyms:
2-(5-chloro-6-(trifluoromethyl)-1H-indol-2-yl)-2-hydroxypropyl benzoate | CHEMBL374638
Type:
Small organic molecule
Emp. Form.:
C19H15ClF3NO3
Mol. Mass.:
397.776
SMILES:
CC(O)(COC(=O)c1ccccc1)c1cc2cc(Cl)c(cc2[nH]1)C(F)(F)F
: