Target
Androgen receptor
Ligand
BDBM50194354
Substrate
Meas. Tech.
ChEMBL_424343 (CHEMBL909546)
IC50
660±n/a nM
Citation
 Lanter, JCFiordeliso, JJAllan, GFMusto, AHahn, do WSui, Z A bioisosteric approach to the discovery of indole carbinol androgen receptor ligands. Bioorg Med Chem Lett 16:5646-9 (2006)  
Target
Name:
Androgen receptor
Synonyms:
ANDR_RAT Ar Nr3c4 | androgen
Type:
Enzyme
Mol. Mass.:
98219.08
Organism:
Rattus norvegicus (Rat)
Description:
P15207
Residue:
902
  
Inhibitor
Name:
BDBM50194354
Synonyms:
2-(5-chloro-1H-indol-2-yl)-1-(4-chlorophenylthio)propan-2-ol | CHEMBL220502
Type:
Small organic molecule
Emp. Form.:
C17H15Cl2NOS
Mol. Mass.:
352.278
SMILES:
CC(O)(CSc1ccc(Cl)cc1)c1cc2cc(Cl)ccc2[nH]1
: