Target
Translocator protein
Ligand
BDBM50205315
Substrate
Meas. Tech.
ChEMBL_425937 (CHEMBL906334)
IC50
60.1±n/a nM
Citation
 Zhang, MRKumata, KMaeda, JHaradahira, TNoguchi, JSuhara, THalldin, CSuzuki, K N-(5-Fluoro-2-phenoxyphenyl)-N-(2-[(131)I]iodo-5-me thoxybenzyl)acetamide: a potent iodinated radioligand for the peripheral-type benzodiazepine receptor in brain. J Med Chem 50:848-55 (2007)  
Target
Name:
Translocator protein
Synonyms:
Benzodiazepine receptors; peripheral & central Mbr PBR Peripheral benzodiazepine receptor (PBR) TSPO_RAT | Tspo
Type:
Mitochondrion membrane protein
Mol. Mass.:
18945.84
Organism:
Rattus norvegicus (rat)
Description:
Competitive binding experiments were performed on rat kidney mitochondrial membranes.
Residue:
169
  
Inhibitor
Name:
BDBM50205315
Synonyms:
CHEMBL220642 | N-(2,5-dimethoxybenzyl)-N-(5-iodo-2-phenoxyphenyl)acetamide
Type:
Small organic molecule
Emp. Form.:
C23H22INO4
Mol. Mass.:
503.3296
SMILES:
COc1ccc(OC)c(CN(C(C)=O)c2cc(I)ccc2Oc2ccccc2)c1
: