Target
Liver carboxylesterase 1
Ligand
BDBM50204490
Substrate
Meas. Tech.
ChEMBL_428057 (CHEMBL914371)
IC50
300±n/a nM
Citation
 Romero, FADu, WHwang, IRayl, TJKimball, FSLeung, DHoover, HSApodaca, RLBreitenbucher, JGCravatt, BFBoger, DL Potent and selective alpha-ketoheterocycle-based inhibitors of the anandamide and oleamide catabolizing enzyme, fatty acid amide hydrolase. J Med Chem 50:1058-68 (2007)  
Target
Name:
Liver carboxylesterase 1
Synonyms:
Acyl coenzyme A:cholesterol acyltransferase CES1 EST1_HUMAN Serine hydrolase (CES1)
Type:
Protein
Mol. Mass.:
62520.83
Organism:
Homo sapiens (Human)
Description:
Residue:
567
  
Inhibitor
Name:
BDBM50204490
Synonyms:
CHEMBL220784 | methyl 2-(7-phenylheptanoyl)oxazole-5-carboxylate
Type:
Small organic molecule
Emp. Form.:
C18H21NO4
Mol. Mass.:
315.3636
SMILES:
COC(=O)c1cnc(o1)C(=O)CCCCCCc1ccccc1
: