Target
Fatty-acid amide hydrolase 1
Ligand
BDBM50411287
Substrate
Meas. Tech.
ChEMBL_428054 (CHEMBL914372)
Ki
3±n/a nM
Citation
 Romero, FADu, WHwang, IRayl, TJKimball, FSLeung, DHoover, HSApodaca, RLBreitenbucher, JGCravatt, BFBoger, DL Potent and selective alpha-ketoheterocycle-based inhibitors of the anandamide and oleamide catabolizing enzyme, fatty acid amide hydrolase. J Med Chem 50:1058-68 (2007)  
Target
Name:
Fatty-acid amide hydrolase 1
Synonyms:
Anandamide amidohydrolase FAAH FAAH1_HUMAN Fatty-acid amide hydrolase (FAAH) Oleamide hydrolase 1
Type:
Protein
Mol. Mass.:
63071.19
Organism:
Homo sapiens (Human)
Description:
O00519
Residue:
579
  
Inhibitor
Name:
BDBM50411287
Synonyms:
CHEMBL220312
Type:
Small organic molecule
Emp. Form.:
C20H22N2O4S2
Mol. Mass.:
418.53
SMILES:
NS(=O)(=O)c1ccc(s1)-c1cnc(o1)C(=O)CCCCCCc1ccccc1
: