Target
ATP-dependent translocase ABCB1
Ligand
BDBM50134991
Substrate
Meas. Tech.
ChEMBL_429163 (CHEMBL914418)
EC50
70±n/a nM
Citation
 Kaiser, DTerfloth, LKopp, SSchulz, Jde Laet, RChiba, PEcker, GFGasteiger, J Self-organizing maps for identification of new inhibitors of P-glycoprotein. J Med Chem 50:1698-702 (2007)  
Target
Name:
ATP-dependent translocase ABCB1
Synonyms:
ABCB1 MDR1_HUMAN Multidrug resistance protein 1 P-glycoprotein (P-gp) PGY1
Type:
Protein
Mol. Mass.:
141503.50
Organism:
Homo sapiens (Human)
Description:
P08183
Residue:
1280
  
Inhibitor
Name:
BDBM50134991
Synonyms:
1-(2-(3-(4-(4-fluorophenyl)piperazin-1-yl)-2-hydroxypropoxy)phenyl)-3-phenylpropan-1-one CHEMBL318061
Type:
Small organic molecule
Emp. Form.:
C28H31FN2O3
Mol. Mass.:
462.5557
SMILES:
OC(COc1ccccc1C(=O)CCc1ccccc1)CN1CCN(CC1)c1ccc(F)cc1
: