Target
Creatine kinase M-type
Ligand
BDBM50370908
Substrate
Meas. Tech.
ChEMBL_429452 (CHEMBL917695)
IC50
50000±n/a nM
Citation
 Bretonnet, ASJochum, AWalker, OKrimm, IGoekjian, PMarcillat, OLancelin, JM NMR screening applied to the fragment-based generation of inhibitors of creatine kinase exploiting a new interaction proximate to the ATP binding site. J Med Chem 50:1865-75 (2007)  
Target
Name:
Creatine kinase M-type
Synonyms:
CKM KCRM_RABIT | M-CK
Type:
PROTEIN
Mol. Mass.:
43117.10
Organism:
Oryctolagus cuniculus
Description:
ChEMBL_429452
Residue:
381
  
Inhibitor
Name:
BDBM50370908
Synonyms:
CHEMBL373782
Type:
Small organic molecule
Emp. Form.:
C25H17NO5
Mol. Mass.:
411.4062
SMILES:
OC(=O)c1ccc(o1)-c1ccc(cc1)C(=O)Nc1ccc(cc1)C(=O)c1ccccc1
: