Target
Cannabinoid receptor 1
Ligand
BDBM50177166
Substrate
Meas. Tech.
ChEMBL_431067 (CHEMBL917772)
Ki
3450±n/a nM
Citation
 Muccioli, GGWouters, JScriba, GKPoppitz, WPoupaert, JHLambert, DM 1-Benzhydryl-3-phenylurea and 1-benzhydryl-3-phenylthiourea derivatives: new templates among the CB1 cannabinoid receptor inverse agonists. J Med Chem 48:7486-90 (2005)  
Target
Name:
Cannabinoid receptor 1
Synonyms:
CANN6 CB-R CNR CNR1_HUMAN Cannabinoid receptor Cannabinoid receptor 1 (brain)
Type:
G Protein-Coupled Receptor (GPCR)
Mol. Mass.:
52868.96
Organism:
Homo sapiens (Human)
Description:
P21554
Residue:
472
  
Inhibitor
Name:
BDBM50177166
Synonyms:
5,5'-bis(4-bromophenyl)-3-phenyl-2-thioxoimidazolidin-4-one | CHEMBL388399
Type:
Small organic molecule
Emp. Form.:
C21H14Br2N2OS
Mol. Mass.:
502.222
SMILES:
Brc1ccc(cc1)C1(NC(=S)N(C1=O)c1ccccc1)c1ccc(Br)cc1
: