Target
Triosephosphate isomerase
Ligand
BDBM50198028
Substrate
Meas. Tech.
ChEMBL_440848 (CHEMBL889943)
Ki
>1000000±n/a nM
Citation
 Fonvielle, MTherisod, HHemery, MTherisod, M New competitive inhibitors of cytosolic (NADH-dependent) rabbit muscle glycerophosphate dehydrogenase. Bioorg Med Chem Lett 17:410-3 (2007)  
Target
Name:
Triosephosphate isomerase
Synonyms:
TIM TPI1 Triose-phosphate isomerase Triosephosphate isomerase (TIM)
Type:
Enzyme
Mol. Mass.:
30788.11
Organism:
Homo sapiens (Human)
Description:
P60174
Residue:
286
  
Inhibitor
Name:
BDBM50198028
Synonyms:
hydrogen 1-hydroxy-3-(hydroxyamino)-3-oxopropylphosphonate
Type:
Small organic molecule
Emp. Form.:
C3H7NO6P
Mol. Mass.:
184.0651
SMILES:
ONC(=O)CC(=O)P(O)(O)[O-]
: