Target
C-C chemokine receptor type 5
Ligand
BDBM50198936
Substrate
Meas. Tech.
ChEMBL_441026 (CHEMBL890113)
IC50
1.1±n/a nM
Citation
 Nishizawa, RNishiyama, THisaichi, KMatsunaga, NMinamoto, CHabashita, HTakaoka, YToda, MShibayama, STada, HSagawa, KFukushima, DMaeda, KMitsuya, H Spirodiketopiperazine-based CCR5 antagonists: Lead optimization from biologically active metabolite. Bioorg Med Chem Lett 17:727-31 (2007)  
Target
Name:
C-C chemokine receptor type 5
Synonyms:
C-C CKR-5 CC-CKR-5 CCR5 CCR5_HUMAN CHEMR13 HIV-1 fusion coreceptor
Type:
Enzyme
Mol. Mass.:
40540.21
Organism:
Homo sapiens (Human)
Description:
P51681
Residue:
352
  
Inhibitor
Name:
BDBM50198936
Synonyms:
(R)-1-butyl-3-((R)-cyclohexyl-hydroxy-methyl)-9-(4-phenoxy-benzyl)-1,4,9-triaza-spiro[5.5]undecane-2,5-dione hydrochloride | CHEMBL536754
Type:
Small organic molecule
Emp. Form.:
C32H43N3O4
Mol. Mass.:
533.7015
SMILES:
CCCCN1C(=O)[C@H](NC(=O)C11CCN(Cc2ccc(Oc3ccccc3)cc2)CC1)[C@H](O)C1CCCCC1
: