Target
Dehydrogenase/reductase SDR family member 9
Ligand
BDBM50371115
Substrate
Meas. Tech.
ChEMBL_443070 (CHEMBL892201)
IC50
114000±n/a nM
Citation
 Gebhardt, PDornberger, KGollmick, FAGräfe, UHärtl, AGörls, HSchlegel, BHertweck, C Quercinol, an anti-inflammatory chromene from the wood-rotting fungus Daedalea quercina (Oak Mazegill). Bioorg Med Chem Lett 17:2558-60 (2007)  
Target
Name:
Dehydrogenase/reductase SDR family member 9
Synonyms:
DHRS9 RDH15 | SDR9C4
Type:
PROTEIN
Mol. Mass.:
35234.21
Organism:
Homo sapiens (Human)
Description:
ChEMBL_443070
Residue:
319
  
Inhibitor
Name:
BDBM50371115
Synonyms:
CHEMBL232615
Type:
Small organic molecule
Emp. Form.:
C11H12O3
Mol. Mass.:
192.2112
SMILES:
C[C@]1(CO)Oc2ccc(O)cc2C=C1
: