Target
Dehydrogenase/reductase SDR family member 9
Ligand
BDBM17638
Substrate
Meas. Tech.
ChEMBL_443070 (CHEMBL892201)
IC50
14000±n/a nM
Citation
 Gebhardt, PDornberger, KGollmick, FAGräfe, UHärtl, AGörls, HSchlegel, BHertweck, C Quercinol, an anti-inflammatory chromene from the wood-rotting fungus Daedalea quercina (Oak Mazegill). Bioorg Med Chem Lett 17:2558-60 (2007)  
Target
Name:
Dehydrogenase/reductase SDR family member 9
Synonyms:
DHRS9 RDH15 | SDR9C4
Type:
PROTEIN
Mol. Mass.:
35234.21
Organism:
Homo sapiens (Human)
Description:
ChEMBL_443070
Residue:
319
  
Inhibitor
Name:
BDBM17638
Synonyms:
2-{1-[(4-chlorophenyl)carbonyl]-5-methoxy-2-methyl-1H-indol-3-yl}acetic acid Indocin US11478464, Compound Indomethacin US9271961, Indomethacin | indometacin
Type:
Small organic molecule
Emp. Form.:
C19H16ClNO4
Mol. Mass.:
357.788
SMILES:
COc1ccc2n(C(=O)c3ccc(Cl)cc3)c(C)c(CC(O)=O)c2c1
: