Target
Dehydrogenase/reductase SDR family member 9
Ligand
BDBM50359629
Substrate
Meas. Tech.
ChEMBL_443070 (CHEMBL892201)
IC50
>1000000±n/a nM
Citation
 Gebhardt, PDornberger, KGollmick, FAGräfe, UHärtl, AGörls, HSchlegel, BHertweck, C Quercinol, an anti-inflammatory chromene from the wood-rotting fungus Daedalea quercina (Oak Mazegill). Bioorg Med Chem Lett 17:2558-60 (2007)  
Target
Name:
Dehydrogenase/reductase SDR family member 9
Synonyms:
DHRS9 RDH15 | SDR9C4
Type:
PROTEIN
Mol. Mass.:
35234.21
Organism:
Homo sapiens (Human)
Description:
ChEMBL_443070
Residue:
319
  
Inhibitor
Name:
BDBM50359629
Synonyms:
TROLOX
Type:
Small organic molecule
Emp. Form.:
C14H18O4
Mol. Mass.:
250.2903
SMILES:
Cc1c(C)c2OC(C)(CCc2c(C)c1O)C(O)=O
: