Target
Metabotropic glutamate receptor 7
Ligand
BDBM50007548
Substrate
Meas. Tech.
ChEMBL_443090 (CHEMBL892221)
EC50
188000±n/a nM
Citation
 Marinozzi, MSerpi, MAmori, LGavilan Diaz, MCostantino, GMeyer, UFlor, PJGasparini, FHeckendorn, RKuhn, RGiorgi, GHermit, MBThomsen, CPellicciari, R Synthesis and preliminary pharmacological evaluation of the four stereoisomers of (2S)-2-(2'-phosphono-3'-phenylcyclopropyl)glycine, the first class of 3'-substituted trans C1'-2'-2-(2'-phosphonocyclopropyl)glycines. Bioorg Med Chem 15:3161-70 (2007)  
Target
Name:
Metabotropic glutamate receptor 7
Synonyms:
GPRC1G GRM7 protein MGLUR7 metabotropic glutamate 7
Type:
Enzyme Catalytic Domain
Mol. Mass.:
102262.98
Organism:
Homo sapiens (Human)
Description:
Q14831
Residue:
915
  
Inhibitor
Name:
BDBM50007548
Synonyms:
(S)-2-Amino-4-phosphono-butyric acid 2-Amino-3-(3,5-dioxo-[1,2,4]oxadiazolidin-2-yl)-propionic acid 2-Amino-4-phosphono-butyric acid(S-AP4) 2-amino-4-phosphonobutyric acid L-(+)-2-amino-4-phosphonobutyric acid L-AP4 | L-APB
Type:
Small organic molecule
Emp. Form.:
C4H10NO5P
Mol. Mass.:
183.0997
SMILES:
N[C@@H](CCP(O)(O)=O)C(O)=O
: