Target
Vasopressin V1a receptor
Ligand
BDBM50221816
Substrate
Meas. Tech.
ChEMBL_446241 (CHEMBL895348)
Ki
2.1±n/a nM
Citation
 Albizu, LTeppaz, GSeyer, RBazin, HAnsanay, HManning, MMouillac, BDurroux, T Toward efficient drug screening by homogeneous assays based on the development of new fluorescent vasopressin and oxytocin receptor ligands. J Med Chem 50:4976-85 (2007)  
Target
Name:
Vasopressin V1a receptor
Synonyms:
AVPR V1a AVPR1A V1AR_HUMAN VASOPRESSIN V1A Vasopressin V1 receptor Vasopressin receptor
Type:
Receptor
Mol. Mass.:
46820.18
Organism:
Homo sapiens (Human)
Description:
P37288
Residue:
418
  
Inhibitor
Name:
BDBM50221816
Synonyms:
5-({N-[(1S)-5-amino-1-carbamoylpentyl]-1-[(3S)-1-[(2S)-5-carbamimidamido-2-[(2S)-3-carbamoyl-2-[(2S)-4-carbamoyl-2-[(2S)-2-[(2R)-3-(4-hydroxyphenyl)-2-[3-(4-hydroxyphenyl)-N-methylpropanamido]propanamido]-3-phenylpropanamido]butanamido]propanamido]pentanoyl]pyrrolidin-3-yl]formamido}carbonyl)-2-(6-amino-3-iminiumyl-4,5-disulfonato-3H-xanthen-9-yl)benzoate [Lys8(Alexa 546)]PVA
Type:
Small organic molecule
Emp. Form.:
C75H86N16O22S2
Mol. Mass.:
1627.71
SMILES:
CN([C@H](Cc1ccc(O)cc1)C(=O)N[C@@H](Cc1ccccc1)C(=O)N[C@@H](CCC(N)=O)C(=O)N[C@@H](CC(N)=O)C(=O)N[C@@H](CCCN=C(N)N)C(=O)N1CC[C@@H](C1)C(=O)N([C@@H](CCCCN)C(N)=O)C(=O)c1ccc(c(c1)C([O-])=O)-c1c2ccc(N)c(c2oc2c(c(=[NH2+])ccc12)S([O-])(=O)=O)S([O-])(=O)=O)C(=O)CCc1ccc(O)cc1
: