Target
Methyltransferase
Ligand
BDBM50371191
Substrate
Meas. Tech.
ChEMBL_449738 (CHEMBL898844)
Ki
2000±n/a nM
Citation
 Song, ZNes, WD Inactivation of soybean sterol 24-C-methyltransferase by elongated sterol side chains at C26. Bioorg Med Chem Lett 17:5902-6 (2007)  
Target
Name:
Methyltransferase
Synonyms:
S-adenosyl-L-methionine:delta24-sterol-C-methyltransferase
Type:
PROTEIN
Mol. Mass.:
41522.59
Organism:
Glycine max
Description:
ChEMBL_449738
Residue:
367
  
Inhibitor
Name:
BDBM50371191
Synonyms:
CHEMBL238349
Type:
Small organic molecule
Emp. Form.:
C29H50OS
Mol. Mass.:
446.772
SMILES:
CC(C)SCC[C@@H](C)[C@H]1CC[C@@]2(C)[C@@H]3CC[C@@H]4C5(CC35CC[C@]12C)CC[C@H](O)C4(C)C
: