Target
Methyltransferase
Ligand
BDBM50371192
Substrate
Meas. Tech.
ChEMBL_449738 (CHEMBL898844)
Ki
42000±n/a nM
Citation
 Song, ZNes, WD Inactivation of soybean sterol 24-C-methyltransferase by elongated sterol side chains at C26. Bioorg Med Chem Lett 17:5902-6 (2007)  
Target
Name:
Methyltransferase
Synonyms:
S-adenosyl-L-methionine:delta24-sterol-C-methyltransferase
Type:
PROTEIN
Mol. Mass.:
41522.59
Organism:
Glycine max
Description:
ChEMBL_449738
Residue:
367
  
Inhibitor
Name:
BDBM50371192
Synonyms:
CHEMBL393145
Type:
Small organic molecule
Emp. Form.:
C30H50O
Mol. Mass.:
426.7174
SMILES:
[#6]-[#6@H](-[#6]-[#6]\[#6]=[#6](\[#6])-[#6])-[#6@H]1-[#6]-[#6][C@@]2([#6])[#6@@H]3-[#6]-[#6]-[#6@@H]4C5([#6]C35[#6]-[#6][C@]12[#6])[#6]-[#6]-[#6@H](-[#8])C4([#6])[#6]
: