Target
DNA polymerase catalytic subunit
Ligand
BDBM50090910
Substrate
Meas. Tech.
ChEMBL_455453 (CHEMBL886229)
IC50
487±n/a nM
Citation
 Schnute, MEAnderson, DJBrideau, RJCiske, FLCollier, SACudahy, MMEggen, MGenin, MJHopkins, TAJudge, TMKim, EJKnechtel, MLNair, SKNieman, JAOien, NLScott, ATanis, SPVaillancourt, VAWathen, MWWieber, JL 2-Aryl-2-hydroxyethylamine substituted 4-oxo-4,7-dihydrothieno[2,3-b]pyridines as broad-spectrum inhibitors of human herpesvirus polymerases. Bioorg Med Chem Lett 17:3349-53 (2007)  
Target
Name:
DNA polymerase catalytic subunit
Synonyms:
DNA polymerase HFLF2 UL54
Type:
Protein
Mol. Mass.:
137111.39
Organism:
Human cytomegalovirus (HCMV strain AD169)
Description:
P08546
Residue:
1242
  
Inhibitor
Name:
BDBM50090910
Synonyms:
3alpha,16,17,18-tetrahydroxyaphidicolone 6,13-di(hydroxymethyl)-2,6-dimethyl-(1S,2S,5R,6R,7R,10S,12R,13R)-tetracyclo[10.3.1.01,10.02,7]hexadecane-5,13-diol (Aphidicolin) CHEMBL29711 aphidicolin | cid_457964
Type:
Small organic molecule
Emp. Form.:
C20H34O4
Mol. Mass.:
338.4816
SMILES:
C[C@@]1(CO)[C@H](O)CC[C@@]2(C)[C@H]1CC[C@H]1C[C@@H]3C[C@]21CC[C@]3(O)CO
: