Target
Estrogen receptor beta
Ligand
BDBM8885
Substrate
Meas. Tech.
ChEMBL_455543 (CHEMBL886322)
IC50
>10000±n/a nM
Citation
 Blizzard, TAGude, CChan, WBirzin, ETMojena, MTudela, CChen, FKnecht, KSu, QKraker, BHolmes, MARohrer, SPHammond, ML Bridged androstenediol analogs as ER-beta selective SERMs. Bioorg Med Chem Lett 17:2944-8 (2007)  
Target
Name:
Estrogen receptor beta
Synonyms:
ER-beta ESR2_HUMAN Estradiol receptor beta (ERβ) Estrogen receptor (ER beta) Estrogen receptor beta (ER beta) NR3A2 estrogen beta
Type:
Protein
Mol. Mass.:
59238.43
Organism:
Homo sapiens (Human)
Description:
Q92731
Residue:
530
  
Inhibitor
Name:
BDBM8885
Synonyms:
(1S,2R,10R,11S,14S,15S)-14-hydroxy-2,15-dimethyltetracyclo[8.7.0.0^{2,7}.0^{11,15}]heptadec-6-en-5-one Testosterone US9682960, Testosterone
Type:
Steroid
Emp. Form.:
C19H28O2
Mol. Mass.:
288.4244
SMILES:
[H][C@@]12CC[C@H](O)[C@@]1(C)CC[C@@]1([H])[C@@]2([H])CCC2=CC(=O)CC[C@]12C
: