Target
Androgen receptor
Ligand
BDBM50223229
Substrate
Meas. Tech.
ChEMBL_458140 (CHEMBL925473)
IC50
2250±n/a nM
Citation
 Blizzard, TAGude, CMorgan, JDChan, WBirzin, ETMojena, MTudela, CChen, FKnecht, KSu, QKraker, BMosley, RTHolmes, MARohrer, SPHammond, ML Androstene-3,5-dienes as ER-beta selective SERMs. Bioorg Med Chem Lett 17:6295-8 (2007)  
Target
Name:
Androgen receptor
Synonyms:
ANDR_HUMAN Androgen Receptor Androgen receptor/Baculoviral IAP repeat-containing protein 2 Dihydrotestosterone receptor Nuclear receptor subfamily 3 group C member 4
Type:
Receptor
Mol. Mass.:
99185.27
Organism:
Homo sapiens (Human)
Description:
CHO cells were stably transfected with human AR gene.
Residue:
920
  
Inhibitor
Name:
BDBM50223229
Synonyms:
(8R,9S,10R,13S,14S,17S)-3,10,13-trimethyl-2,7,8,9,10,11,12,13,14,15,16,17-dodecahydro-1H-cyclopenta[a]phenanthren-17-ol | CHEMBL250110
Type:
Small organic molecule
Emp. Form.:
C20H30O
Mol. Mass.:
286.4516
SMILES:
CC1=CC2=CC[C@H]3[C@@H]4CC[C@H](O)[C@@]4(C)CC[C@@H]3[C@@]2(C)CC1
: