Target
Kinesin-like protein KIF11
Ligand
BDBM50181138
Substrate
Meas. Tech.
ChEMBL_458813 (CHEMBL942113)
IC50
1.2±n/a nM
Citation
 Liu, FYou, QDChen, YD Pharmacophore identification of KSP inhibitors. Bioorg Med Chem Lett 17:722-6 (2007)  
Target
Name:
Kinesin-like protein KIF11
Synonyms:
EG5 KIF11_HUMAN Kinesin Spindle Protein Eg5 TRIP5 | kinesin spindle protein
Type:
PROTEIN
Mol. Mass.:
119138.97
Organism:
Homo sapiens (Human)
Description:
ChEMBL_1457426
Residue:
1056
  
Inhibitor
Name:
BDBM50181138
Synonyms:
(S)-2-amino-1-((S)-4-(2,5-difluorophenyl)-2-(3-hydroxyphenyl)-2H-pyrrol-1(5H)-yl)-3-methylbutan-1-one | CHEMBL381526
Type:
Small organic molecule
Emp. Form.:
C21H22F2N2O2
Mol. Mass.:
372.4084
SMILES:
CC(C)[C@H](N)C(=O)N1CC(=C[C@H]1c1cccc(O)c1)c1cc(F)ccc1F
: