Target
Carbonic anhydrase 2
Ligand
BDBM50211826
Substrate
Meas. Tech.
ChEMBL_459050 (CHEMBL925142)
Ki
100±n/a nM
Citation
 Supuran, CTScozzafava, A Carbonic anhydrases as targets for medicinal chemistry. Bioorg Med Chem 15:4336-50 (2007)  
Target
Name:
Carbonic anhydrase 2
Synonyms:
CA-II CAC Carbonate dehydratase II Carbonic anhydrase 2 (CA-II) Carbonic anhydrase C Carbonic anhydrase II (CA-II) Carbonic anhydrase II (hCA II) | Carbonic anhydrase isoenzyme II (hCA II)
Type:
Enzyme
Mol. Mass.:
29250.71
Organism:
Homo sapiens (Human)
Description:
P00918
Residue:
260
  
Inhibitor
Name:
BDBM50211826
Synonyms:
2-[(1E)-{[2-(4-sulfamoylphenyl)ethyl]imino}methyl]phenyl N-[(4-chlorobenzene)sulfonyl]carbamate | CHEMBL399457
Type:
Small organic molecule
Emp. Form.:
C22H20ClN3O6S2
Mol. Mass.:
521.994
SMILES:
NS(=O)(=O)c1ccc(CCN=Cc2ccccc2OC(=O)NS(=O)(=O)c2ccc(Cl)cc2)cc1
: