Target
Carbonic anhydrase 1
Ligand
BDBM50211826
Substrate
Meas. Tech.
ChEMBL_459049 (CHEMBL925141)
Ki
60±n/a nM
Citation
 Supuran, CTScozzafava, A Carbonic anhydrases as targets for medicinal chemistry. Bioorg Med Chem 15:4336-50 (2007)  
Target
Name:
Carbonic anhydrase 1
Synonyms:
CA-I CAB Carbonate dehydratase I Carbonic anhydrase 1 (CA I) Carbonic anhydrase 1 (Recombinant CA I) Carbonic anhydrase B Carbonic anhydrase I (CA I) Carbonic anhydrase I (CAI) Carbonic anhydrase isoenzyme I (hCA I) | hCA
Type:
Enzyme
Mol. Mass.:
28873.37
Organism:
Homo sapiens (Human)
Description:
P00915
Residue:
261
  
Inhibitor
Name:
BDBM50211826
Synonyms:
2-[(1E)-{[2-(4-sulfamoylphenyl)ethyl]imino}methyl]phenyl N-[(4-chlorobenzene)sulfonyl]carbamate | CHEMBL399457
Type:
Small organic molecule
Emp. Form.:
C22H20ClN3O6S2
Mol. Mass.:
521.994
SMILES:
NS(=O)(=O)c1ccc(CCN=Cc2ccccc2OC(=O)NS(=O)(=O)c2ccc(Cl)cc2)cc1
: