Target
Cytochrome P450 1A1
Ligand
BDBM50084978
Substrate
Meas. Tech.
ChEMBL_459099 (CHEMBL926267)
IC50
300±n/a nM
Citation
 Bruno, RDNjar, VC Targeting cytochrome P450 enzymes: a new approach in anti-cancer drug development. Bioorg Med Chem 15:5047-60 (2007)  
Target
Name:
Cytochrome P450 1A1
Synonyms:
CP1A1_HUMAN CYPIA1 Cytochrome P450 1A1 P450 form 6 P450-P1
Type:
Protein
Mol. Mass.:
58177.23
Organism:
Homo sapiens (Human)
Description:
P04798
Residue:
512
  
Inhibitor
Name:
BDBM50084978
Synonyms:
3,5,7-trihydroxy-2-(4-methoxyphenyl)-4H-chromen-4-one Kaempferide | Kaempferol 4'-methyl ether
Type:
Small organic molecule
Emp. Form.:
C16H12O6
Mol. Mass.:
300.2629
SMILES:
COc1ccc(cc1)-c1oc2cc(O)cc(O)c2c(=O)c1O
: