Target
Cytochrome P450 1B1
Ligand
BDBM50214608
Substrate
Meas. Tech.
ChEMBL_459098 (CHEMBL926266)
IC50
2±n/a nM
Citation
 Bruno, RDNjar, VC Targeting cytochrome P450 enzymes: a new approach in anti-cancer drug development. Bioorg Med Chem 15:5047-60 (2007)  
Target
Name:
Cytochrome P450 1B1
Synonyms:
CP1B1_HUMAN CYPIB1 | Cytochrome P450 1B1 (CYP1B1)
Type:
PROTEIN
Mol. Mass.:
60861.81
Organism:
Homo sapiens (Human)
Description:
ChEMBL_1474523
Residue:
543
  
Inhibitor
Name:
BDBM50214608
Synonyms:
CHEMBL279564 | pyrene
Type:
Small organic molecule
Emp. Form.:
C16H10
Mol. Mass.:
202.2506
SMILES:
c1cc2ccc3cccc4ccc(c1)c2c34
: