Target
Sterol 26-hydroxylase, mitochondrial
Ligand
BDBM50214607
Substrate
Meas. Tech.
ChEMBL_459094 (CHEMBL926262)
IC50
>1000±n/a nM
Citation
 Bruno, RDNjar, VC Targeting cytochrome P450 enzymes: a new approach in anti-cancer drug development. Bioorg Med Chem 15:5047-60 (2007)  
Target
Name:
Sterol 26-hydroxylase, mitochondrial
Synonyms:
CP27A_HUMAN CYP27A1
Type:
PROTEIN
Mol. Mass.:
60250.67
Organism:
Homo sapiens (Human)
Description:
ChEMBL_430507
Residue:
531
  
Inhibitor
Name:
BDBM50214607
Synonyms:
CHEMBL541423 MK-24(S)-S(O)(NH)Ph
Type:
Small organic molecule
Emp. Form.:
C29H39NO3S
Mol. Mass.:
481.69
SMILES:
C[C@H](CC=S(N)(=O)c1ccccc1)C1=CCC2\C(CCC[C@]12C)=C\C=C1\C[C@@H](O)C[C@H](O)C1=C
: