Target
Cytochrome P450 1A2
Ligand
BDBM50214608
Substrate
Meas. Tech.
ChEMBL_459100 (CHEMBL926268)
IC50
7±n/a nM
Citation
 Bruno, RDNjar, VC Targeting cytochrome P450 enzymes: a new approach in anti-cancer drug development. Bioorg Med Chem 15:5047-60 (2007)  
Target
Name:
Cytochrome P450 1A2
Synonyms:
CP1A2_HUMAN CYPIA2 Cytochrome P(3)450 Cytochrome P450 1A2 (CYP1A2) Cytochrome P450-P3
Type:
Enzyme
Mol. Mass.:
58423.38
Organism:
Homo sapiens (Human)
Description:
P05177
Residue:
516
  
Inhibitor
Name:
BDBM50214608
Synonyms:
CHEMBL279564 | pyrene
Type:
Small organic molecule
Emp. Form.:
C16H10
Mol. Mass.:
202.2506
SMILES:
c1cc2ccc3cccc4ccc(c1)c2c34
: