Target
Cytochrome P450 1A1
Ligand
BDBM50325672
Substrate
Meas. Tech.
ChEMBL_459099 (CHEMBL926267)
IC50
>4000±n/a nM
Citation
 Bruno, RDNjar, VC Targeting cytochrome P450 enzymes: a new approach in anti-cancer drug development. Bioorg Med Chem 15:5047-60 (2007)  
Target
Name:
Cytochrome P450 1A1
Synonyms:
CP1A1_HUMAN CYPIA1 Cytochrome P450 1A1 P450 form 6 P450-P1
Type:
Protein
Mol. Mass.:
58177.23
Organism:
Homo sapiens (Human)
Description:
P04798
Residue:
512
  
Inhibitor
Name:
BDBM50325672
Synonyms:
5,7,4'-Trihydroxy-3'-methoxyflavanone HOMOERIODICTYOL
Type:
Small organic molecule
Emp. Form.:
C16H14O6
Mol. Mass.:
302.2788
SMILES:
COc1cc(ccc1O)[C@@H]1CC(=O)c2c(O)cc(O)cc2O1
: