Target
Cytochrome P450 26A1
Ligand
BDBM50214611
Substrate
Meas. Tech.
ChEMBL_459095 (CHEMBL926263)
IC50
2200±n/a nM
Citation
 Bruno, RDNjar, VC Targeting cytochrome P450 enzymes: a new approach in anti-cancer drug development. Bioorg Med Chem 15:5047-60 (2007)  
Target
Name:
Cytochrome P450 26A1
Synonyms:
CP26A_HUMAN CYP26A1 Cytochrome P450 26A1 P450RAI1 | Retinoic acid 4-hydroxylase
Type:
Enzyme
Mol. Mass.:
56216.16
Organism:
Homo sapiens (Human)
Description:
O43174
Residue:
497
  
Inhibitor
Name:
BDBM50214611
Synonyms:
6-((3-chlorophenyl)(4,5-dihydroimidazol-1-yl)methyl)-1H-benzo[d]imidazole | CHEMBL255090
Type:
Small organic molecule
Emp. Form.:
C17H15ClN4
Mol. Mass.:
310.781
SMILES:
Clc1cccc(c1)C(N1CCN=C1)c1ccc2nc[nH]c2c1
: