Target
Cytochrome P450 1A2
Ligand
BDBM50134367
Substrate
Meas. Tech.
ChEMBL_459100 (CHEMBL926268)
IC50
11±n/a nM
Citation
 Bruno, RDNjar, VC Targeting cytochrome P450 enzymes: a new approach in anti-cancer drug development. Bioorg Med Chem 15:5047-60 (2007)  
Target
Name:
Cytochrome P450 1A2
Synonyms:
CP1A2_HUMAN CYPIA2 Cytochrome P(3)450 Cytochrome P450 1A2 (CYP1A2) Cytochrome P450-P3
Type:
Enzyme
Mol. Mass.:
58423.38
Organism:
Homo sapiens (Human)
Description:
P05177
Residue:
516
  
Inhibitor
Name:
BDBM50134367
Synonyms:
2-[(Z)-2-(3,5-Dimethoxy-phenyl)-vinyl]-thiophene CHEMBL122532
Type:
Small organic molecule
Emp. Form.:
C14H14O2S
Mol. Mass.:
246.325
SMILES:
COc1cc(OC)cc(\C=C/c2cccs2)c1
: