Target
Cytochrome P450 1A2
Ligand
BDBM23415
Substrate
Meas. Tech.
ChEMBL_459100 (CHEMBL926268)
IC50
80±n/a nM
Citation
 Bruno, RDNjar, VC Targeting cytochrome P450 enzymes: a new approach in anti-cancer drug development. Bioorg Med Chem 15:5047-60 (2007)  
Target
Name:
Cytochrome P450 1A2
Synonyms:
CP1A2_HUMAN CYPIA2 Cytochrome P(3)450 Cytochrome P450 1A2 (CYP1A2) Cytochrome P450-P3
Type:
Enzyme
Mol. Mass.:
58423.38
Organism:
Homo sapiens (Human)
Description:
P05177
Residue:
516
  
Inhibitor
Name:
BDBM23415
Synonyms:
5,7-dihydroxy-2-(4-methoxyphenyl)-4H-chromen-4-one CHEMBL243664
Type:
flavone
Emp. Form.:
C16H12O5
Mol. Mass.:
284.2635
SMILES:
COc1ccc(cc1)-c1cc(=O)c2c(O)cc(O)cc2o1
: