Target
Cytochrome P450 1A2
Ligand
BDBM50214612
Substrate
Meas. Tech.
ChEMBL_459100 (CHEMBL926268)
IC50
60±n/a nM
Citation
 Bruno, RDNjar, VC Targeting cytochrome P450 enzymes: a new approach in anti-cancer drug development. Bioorg Med Chem 15:5047-60 (2007)  
Target
Name:
Cytochrome P450 1A2
Synonyms:
CP1A2_HUMAN CYPIA2 Cytochrome P(3)450 Cytochrome P450 1A2 (CYP1A2) Cytochrome P450-P3
Type:
Enzyme
Mol. Mass.:
58423.38
Organism:
Homo sapiens (Human)
Description:
P05177
Residue:
516
  
Inhibitor
Name:
BDBM50214612
Synonyms:
2-(1-propynyl)phenanthrene | CHEMBL253346
Type:
Small organic molecule
Emp. Form.:
C17H12
Mol. Mass.:
216.2772
SMILES:
CC#Cc1ccc2c(ccc3ccccc23)c1
: