Target
Cytochrome P450 1A2
Ligand
BDBM50325672
Substrate
Meas. Tech.
ChEMBL_459100 (CHEMBL926268)
IC50
>4000±n/a nM
Citation
 Bruno, RDNjar, VC Targeting cytochrome P450 enzymes: a new approach in anti-cancer drug development. Bioorg Med Chem 15:5047-60 (2007)  
Target
Name:
Cytochrome P450 1A2
Synonyms:
CP1A2_HUMAN CYPIA2 Cytochrome P(3)450 Cytochrome P450 1A2 (CYP1A2) Cytochrome P450-P3
Type:
Enzyme
Mol. Mass.:
58423.38
Organism:
Homo sapiens (Human)
Description:
P05177
Residue:
516
  
Inhibitor
Name:
BDBM50325672
Synonyms:
5,7,4'-Trihydroxy-3'-methoxyflavanone HOMOERIODICTYOL
Type:
Small organic molecule
Emp. Form.:
C16H14O6
Mol. Mass.:
302.2788
SMILES:
COc1cc(ccc1O)[C@@H]1CC(=O)c2c(O)cc(O)cc2O1
: