Target
Mu-type opioid receptor
Ligand
BDBM50229425
Substrate
Meas. Tech.
ChEMBL_460091 (CHEMBL924967)
IC50
49.81±n/a nM
Citation
 Tömböly, CBallet, SFeytens, DKövér, KEBorics, ALovas, SAl-Khrasani, MFürst, ZTóth, GBenyhe, STourwé, D Endomorphin-2 with a beta-turn backbone constraint retains the potent micro-opioid receptor agonist properties. J Med Chem 51:173-7 (2008)  
Target
Name:
Mu-type opioid receptor
Synonyms:
M-OR-1 Mor OPRM_MOUSE Oprm | Oprm1
Type:
Enzyme Catalytic Domain
Mol. Mass.:
44431.62
Organism:
MOUSE
Description:
OPIATE Mu OPRM1 MOUSE::P42866
Residue:
398
  
Inhibitor
Name:
BDBM50229425
Synonyms:
CHEMBL401142 | Tyr-(R)-spiro-Aba-Gly-Phe-NH2
Type:
Small organic molecule
Emp. Form.:
C33H37N5O5
Mol. Mass.:
583.6774
SMILES:
N[C@@H](Cc1ccc(O)cc1)C(=O)N1CCC[C@]11Cc2ccccc2CN(CC(=O)N[C@@H](Cc2ccccc2)C(N)=O)C1=O
: