Target
Tumor susceptibility gene 101 protein
Ligand
BDBM50230463
Substrate
Meas. Tech.
ChEMBL_461905 (CHEMBL944752)
IC50
16000±n/a nM
Citation
 Liu, FStephen, AGFisher, RJBurke, TR Protected aminooxyprolines for expedited library synthesis: application to Tsg101-directed proline-oxime containing peptides. Bioorg Med Chem Lett 18:1096-101 (2008)  
Target
Name:
Tumor susceptibility gene 101 protein
Synonyms:
TS101_HUMAN | TSG101
Type:
PROTEIN
Mol. Mass.:
43943.30
Organism:
Homo sapiens (Human)
Description:
ChEMBL_800321
Residue:
390
  
Inhibitor
Name:
BDBM50230463
Synonyms:
(4S)-4-{[(1S)-1-carbamoyl-3-carboxypropyl]carbamoyl}-4-{[(2S,4R)-1-({1-[(2S)-2-[(2S,3R)-2-{[(2S)-1-[(2S)-4-carboxy-2-{[(2S)-1-{5-[({3',6'-dihydroxy-3-oxo-3H-spiro[2-benzofuran-1,9'-xanthene]-6-yl}carbamothioyl)amino]pentanoyl}pyrrolidin-2-yl]formamido}butanoyl]pyrrolidin-2-yl]formamido}-3-hydroxybutanamido]propanoyl]piperidin-2-yl}carbonyl)-4-{[(Z)-[(3,4-dimethoxyphenyl)methylidene]amino]oxy}pyrrolidin-2-yl]formamido}butanoic acid | CHEMBL410762
Type:
Small organic molecule
Emp. Form.:
C78H95N13O25S
Mol. Mass.:
1646.726
SMILES:
COc1ccc(\C=N/O[C@@H]2C[C@H](N(C2)C(=O)C2CCCCN2C(=O)[C@H](C)NC(=O)[C@@H](NC(=O)[C@@H]2CCCN2C(=O)[C@H](CCC(O)=O)NC(=O)[C@@H]2CCCN2C(=O)CCCCNC(=S)Nc2ccc3C(=O)OC4(c3c2)c2ccc(O)cc2Oc2cc(O)ccc42)[C@@H](C)O)C(=O)N[C@@H](CCC(O)=O)C(=O)N[C@@H](CCC(O)=O)C(N)=O)cc1OC
: