Target
Sodium channel protein type 9 subunit alpha
Ligand
BDBM50233761
Substrate
Meas. Tech.
ChEMBL_462438 (CHEMBL927254)
IC50
63±n/a nM
Citation
 London, CHoyt, SBParsons, WHWilliams, BSWarren, VATschirret-Guth, RSmith, MMPriest, BTMcGowan, EMartin, WJLyons, KALi, XKaranam, BVJochnowitz, NGarcia, MLFelix, JPDean, BAbbadie, CKaczorowski, GJDuffy, JL Imidazopyridines: a novel class of hNav1.7 channel blockers. Bioorg Med Chem Lett 18:1696-701 (2008)  
Target
Name:
Sodium channel protein type 9 subunit alpha
Synonyms:
NENA Peripheral sodium channel 1 SCN9A_HUMAN Voltage-gated sodium channel subunit Nav1.7 hNE-Na
Type:
Protein
Mol. Mass.:
226375.97
Organism:
Homo sapiens (Human)
Description:
Q15858
Residue:
1988
  
Inhibitor
Name:
BDBM50233761
Synonyms:
(R)-tert-butyl 1-oxo-1-((3-(1-phenylcyclopropyl)-3H-imidazo[4,5-b]pyridin-2-yl)methylamino)-3-(2,3,6-trifluorophenyl)propan-2-ylcarbamate | CHEMBL252836
Type:
Small organic molecule
Emp. Form.:
C30H30F3N5O3
Mol. Mass.:
565.5861
SMILES:
CC(C)(C)OC(=O)N[C@H](Cc1c(F)ccc(F)c1F)C(=O)NCc1nc2cccnc2n1C1(CC1)c1ccccc1
: