Target
Sodium channel protein type 9 subunit alpha
Ligand
BDBM50233772
Substrate
Meas. Tech.
ChEMBL_462438 (CHEMBL927254)
IC50
261±n/a nM
Citation
 London, CHoyt, SBParsons, WHWilliams, BSWarren, VATschirret-Guth, RSmith, MMPriest, BTMcGowan, EMartin, WJLyons, KALi, XKaranam, BVJochnowitz, NGarcia, MLFelix, JPDean, BAbbadie, CKaczorowski, GJDuffy, JL Imidazopyridines: a novel class of hNav1.7 channel blockers. Bioorg Med Chem Lett 18:1696-701 (2008)  
Target
Name:
Sodium channel protein type 9 subunit alpha
Synonyms:
NENA Peripheral sodium channel 1 SCN9A_HUMAN Voltage-gated sodium channel subunit Nav1.7 hNE-Na
Type:
Protein
Mol. Mass.:
226375.97
Organism:
Homo sapiens (Human)
Description:
Q15858
Residue:
1988
  
Inhibitor
Name:
BDBM50233772
Synonyms:
CHEMBL252037 | N-[(R)-1-[(3-benzyl-3H-imidazo[4,5-b]pyridin-2-ylmethyl)-carbamoyl]-2-(2-trifluoromethyl-phenyl)-ethyl]-2,2-dimethyl-propionamide
Type:
Small organic molecule
Emp. Form.:
C29H30F3N5O2
Mol. Mass.:
537.576
SMILES:
CC(C)(C)C(=O)N[C@H](Cc1ccccc1C(F)(F)F)C(=O)NCc1nc2cccnc2n1Cc1ccccc1
: