Target
Sodium channel protein type 9 subunit alpha
Ligand
BDBM50233773
Substrate
Meas. Tech.
ChEMBL_462438 (CHEMBL927254)
IC50
182±n/a nM
Citation
 London, CHoyt, SBParsons, WHWilliams, BSWarren, VATschirret-Guth, RSmith, MMPriest, BTMcGowan, EMartin, WJLyons, KALi, XKaranam, BVJochnowitz, NGarcia, MLFelix, JPDean, BAbbadie, CKaczorowski, GJDuffy, JL Imidazopyridines: a novel class of hNav1.7 channel blockers. Bioorg Med Chem Lett 18:1696-701 (2008)  
Target
Name:
Sodium channel protein type 9 subunit alpha
Synonyms:
NENA Peripheral sodium channel 1 SCN9A_HUMAN Voltage-gated sodium channel subunit Nav1.7 hNE-Na
Type:
Protein
Mol. Mass.:
226375.97
Organism:
Homo sapiens (Human)
Description:
Q15858
Residue:
1988
  
Inhibitor
Name:
BDBM50233773
Synonyms:
(R)-N-(1-oxo-1-((3-(1-phenylcyclopropyl)-3H-imidazo[4,5-b]pyridin-2-yl)methylamino)-3-(2,3,6-trifluorophenyl)propan-2-yl)-1-(trifluoromethyl)cyclopropanecarboxamide | CHEMBL403809
Type:
Small organic molecule
Emp. Form.:
C30H25F6N5O2
Mol. Mass.:
601.5422
SMILES:
Fc1ccc(F)c(C[C@@H](NC(=O)C2(CC2)C(F)(F)F)C(=O)NCc2nc3cccnc3n2C2(CC2)c2ccccc2)c1F
: