Target
Sodium channel protein type 10 subunit alpha
Ligand
BDBM50233785
Substrate
Meas. Tech.
ChEMBL_462444 (CHEMBL928309)
IC50
825±n/a nM
Citation
 London, CHoyt, SBParsons, WHWilliams, BSWarren, VATschirret-Guth, RSmith, MMPriest, BTMcGowan, EMartin, WJLyons, KALi, XKaranam, BVJochnowitz, NGarcia, MLFelix, JPDean, BAbbadie, CKaczorowski, GJDuffy, JL Imidazopyridines: a novel class of hNav1.7 channel blockers. Bioorg Med Chem Lett 18:1696-701 (2008)  
Target
Name:
Sodium channel protein type 10 subunit alpha
Synonyms:
PN3 SCN10A Sodium channel alpha subunit Sodium channel protein type X alpha subunit fret-membrane potential nav1.8 | hPN3
Type:
Enzyme
Mol. Mass.:
220609.21
Organism:
Homo sapiens (Human)
Description:
Q9Y5Y9
Residue:
1956
  
Inhibitor
Name:
BDBM50233785
Synonyms:
(R)-N-(1-oxo-1-((3-(1-phenylcyclopropyl)-3H-imidazo[4,5-b]pyridin-2-yl)methylamino)-3-(2-(trifluoromethyl)phenyl)propan-2-yl)-2-(trifluoromethoxy)benzamide | CHEMBL400262
Type:
Small organic molecule
Emp. Form.:
C34H27F6N5O3
Mol. Mass.:
667.6003
SMILES:
FC(F)(F)Oc1ccccc1C(=O)N[C@H](Cc1ccccc1C(F)(F)F)C(=O)NCc1nc2cccnc2n1C1(CC1)c1ccccc1
: