Target
Sodium channel protein type 9 subunit alpha
Ligand
BDBM50233789
Substrate
Meas. Tech.
ChEMBL_462438 (CHEMBL927254)
IC50
552±n/a nM
Citation
 London, CHoyt, SBParsons, WHWilliams, BSWarren, VATschirret-Guth, RSmith, MMPriest, BTMcGowan, EMartin, WJLyons, KALi, XKaranam, BVJochnowitz, NGarcia, MLFelix, JPDean, BAbbadie, CKaczorowski, GJDuffy, JL Imidazopyridines: a novel class of hNav1.7 channel blockers. Bioorg Med Chem Lett 18:1696-701 (2008)  
Target
Name:
Sodium channel protein type 9 subunit alpha
Synonyms:
NENA Peripheral sodium channel 1 SCN9A_HUMAN Voltage-gated sodium channel subunit Nav1.7 hNE-Na
Type:
Protein
Mol. Mass.:
226375.97
Organism:
Homo sapiens (Human)
Description:
Q15858
Residue:
1988
  
Inhibitor
Name:
BDBM50233789
Synonyms:
(R)-N-(1-((3-benzyl-3H-imidazo[4,5-b]pyridin-2-yl)methylamino)-1-oxo-3-(2-(trifluoromethyl)phenyl)propan-2-yl)benzamide | CHEMBL399352
Type:
Small organic molecule
Emp. Form.:
C31H26F3N5O2
Mol. Mass.:
557.5656
SMILES:
FC(F)(F)c1ccccc1C[C@@H](NC(=O)c1ccccc1)C(=O)NCc1nc2cccnc2n1Cc1ccccc1
: