Target
Sodium channel protein type 9 subunit alpha
Ligand
BDBM50233791
Substrate
Meas. Tech.
ChEMBL_462438 (CHEMBL927254)
IC50
185±n/a nM
Citation
 London, CHoyt, SBParsons, WHWilliams, BSWarren, VATschirret-Guth, RSmith, MMPriest, BTMcGowan, EMartin, WJLyons, KALi, XKaranam, BVJochnowitz, NGarcia, MLFelix, JPDean, BAbbadie, CKaczorowski, GJDuffy, JL Imidazopyridines: a novel class of hNav1.7 channel blockers. Bioorg Med Chem Lett 18:1696-701 (2008)  
Target
Name:
Sodium channel protein type 9 subunit alpha
Synonyms:
NENA Peripheral sodium channel 1 SCN9A_HUMAN Voltage-gated sodium channel subunit Nav1.7 hNE-Na
Type:
Protein
Mol. Mass.:
226375.97
Organism:
Homo sapiens (Human)
Description:
Q15858
Residue:
1988
  
Inhibitor
Name:
BDBM50233791
Synonyms:
(R)-tert-butyl 1-((3-tert-butyl-3H-imidazo[4,5-b]pyridin-2-yl)methylamino)-1-oxo-3-(2-(trifluoromethyl)phenyl)propan-2-ylcarbamate | CHEMBL252019
Type:
Small organic molecule
Emp. Form.:
C26H32F3N5O3
Mol. Mass.:
519.5592
SMILES:
CC(C)(C)OC(=O)N[C@H](Cc1ccccc1C(F)(F)F)C(=O)NCc1nc2cccnc2n1C(C)(C)C
: