Target
Sodium channel protein type 10 subunit alpha
Ligand
BDBM50233792
Substrate
Meas. Tech.
ChEMBL_462444 (CHEMBL928309)
IC50
500±n/a nM
Citation
 London, CHoyt, SBParsons, WHWilliams, BSWarren, VATschirret-Guth, RSmith, MMPriest, BTMcGowan, EMartin, WJLyons, KALi, XKaranam, BVJochnowitz, NGarcia, MLFelix, JPDean, BAbbadie, CKaczorowski, GJDuffy, JL Imidazopyridines: a novel class of hNav1.7 channel blockers. Bioorg Med Chem Lett 18:1696-701 (2008)  
Target
Name:
Sodium channel protein type 10 subunit alpha
Synonyms:
PN3 SCN10A Sodium channel alpha subunit Sodium channel protein type X alpha subunit fret-membrane potential nav1.8 | hPN3
Type:
Enzyme
Mol. Mass.:
220609.21
Organism:
Homo sapiens (Human)
Description:
Q9Y5Y9
Residue:
1956
  
Inhibitor
Name:
BDBM50233792
Synonyms:
(R)-tert-butyl 3-(2-chlorophenyl)-1-oxo-1-((3-(1-phenylcyclopropyl)-3H-imidazo[4,5-b]pyridin-2-yl)methylamino)propan-2-ylcarbamate | CHEMBL404621
Type:
Small organic molecule
Emp. Form.:
C30H32ClN5O3
Mol. Mass.:
546.06
SMILES:
CC(C)(C)OC(=O)N[C@H](Cc1ccccc1Cl)C(=O)NCc1nc2cccnc2n1C1(CC1)c1ccccc1
: