Target
UDP-N-acetylmuramoyl-tripeptide--D-alanyl-D-alanine ligase
Ligand
BDBM81629
Substrate
Meas. Tech.
ChEMBL_463169 (CHEMBL946185)
IC50
12600±n/a nM
Citation
 Taha, MOAtallah, NAl-Bakri, AGParadis-Bleau, CZalloum, HYounis, KSLevesque, RC Discovery of new MurF inhibitors via pharmacophore modeling and QSAR analysis followed by in-silico screening. Bioorg Med Chem 16:1218-35 (2008)  
Target
Name:
UDP-N-acetylmuramoyl-tripeptide--D-alanyl-D-alanine ligase
Synonyms:
MurF (S. pneumoniae) UDP-N-acetylmuramoylalanine-D-glutamyl-lysine-D-alanyl-D-alanine ligase
Type:
Protein
Mol. Mass.:
50482.72
Organism:
Streptococcus pneumoniae (Firmicutes)
Description:
S. pneumoniae MurF
Residue:
457
  
Inhibitor
Name:
BDBM81629
Synonyms:
MurF inhibitor, 13
Type:
Small organic molecule
Emp. Form.:
C16H15BrClN3O3S2
Mol. Mass.:
476.796
SMILES:
CCN(CC)S(=O)(=O)c1ccc(Cl)c(c1)C(=O)Nc1sc(Br)cc1C#N
: