Target
UDP-N-acetylmuramoyl-tripeptide--D-alanyl-D-alanine ligase
Ligand
BDBM50137774
Substrate
Meas. Tech.
ChEMBL_463169 (CHEMBL946185)
IC50
>100000±n/a nM
Citation
 Taha, MOAtallah, NAl-Bakri, AGParadis-Bleau, CZalloum, HYounis, KSLevesque, RC Discovery of new MurF inhibitors via pharmacophore modeling and QSAR analysis followed by in-silico screening. Bioorg Med Chem 16:1218-35 (2008)  
Target
Name:
UDP-N-acetylmuramoyl-tripeptide--D-alanyl-D-alanine ligase
Synonyms:
MurF (S. pneumoniae) UDP-N-acetylmuramoylalanine-D-glutamyl-lysine-D-alanyl-D-alanine ligase
Type:
Protein
Mol. Mass.:
50482.72
Organism:
Streptococcus pneumoniae (Firmicutes)
Description:
S. pneumoniae MurF
Residue:
457
  
Inhibitor
Name:
BDBM50137774
Synonyms:
CHEMBL313359 | N-(3-Aminomethyl-5,6-dihydro-4H-cyclopenta[b]thiophen-2-yl)-2-chloro-5-diethylsulfamoyl-benzamide
Type:
Small organic molecule
Emp. Form.:
C19H24ClN3O3S2
Mol. Mass.:
441.995
SMILES:
CCN(CC)S(=O)(=O)c1ccc(Cl)c(c1)C(=O)Nc1sc2CCCc2c1CN
: