Target
UDP-N-acetylmuramoyl-tripeptide--D-alanyl-D-alanine ligase
Ligand
BDBM50371272
Substrate
Meas. Tech.
ChEMBL_463171 (CHEMBL946187)
IC50
>5000000±n/a nM
Citation
 Taha, MOAtallah, NAl-Bakri, AGParadis-Bleau, CZalloum, HYounis, KSLevesque, RC Discovery of new MurF inhibitors via pharmacophore modeling and QSAR analysis followed by in-silico screening. Bioorg Med Chem 16:1218-35 (2008)  
Target
Name:
UDP-N-acetylmuramoyl-tripeptide--D-alanyl-D-alanine ligase
Synonyms:
Type:
PROTEIN
Mol. Mass.:
47381.53
Organism:
Pseudomonas aeruginosa
Description:
ChEMBL_463171
Residue:
458
  
Inhibitor
Name:
BDBM50371272
Synonyms:
CHEMBL271393 | NSC-35952
Type:
Small organic molecule
Emp. Form.:
C16H14Cl2N2O4S6
Mol. Mass.:
561.589
SMILES:
Clc1ccc(cc1)S(=O)(=O)SC(=S)NCCNC(=S)SS(=O)(=O)c1ccc(Cl)cc1
: